Reaction Details
TargetComplement factor D
LigandBDBM50236211
Substrate/Competitorn/a
Meas. Tech.ChEMBL_1658825 (CHEMBL4008437)
IC50>30000±n/a nM
Citation Vulpetti, ARandl, SRüdisser, SOstermann, NErbel, PMac Sweeney, AZoller, TSalem, BGerhartz, BCumin, FHommel, UDalvit, CLorthiois, EMaibaum, J Structure-Based Library Design and Fragment Screening for the Identification of Reversible Complement Factor D Protease Inhibitors. J Med Chem60:1946-1958 (2017) 
 
Complement factor D
Name:Complement factor D
Type:Protein
Mol. Mass.:27039.19
Organism:Homo sapiens (Human)
Description:P00746
Residue:253
BDBM50236211
NameBDBM50236211
Synonyms:CHEMBL4065974
TypeSmall organic molecule
Emp. Form.C21H20F3N3O5
Mol. Mass.451.3958
SMILESCOC(=O)c1cccc(NC(=O)N2CCC[C@H]2C(=O)Nc2cccc(OC(F)(F)F)c2)c1