Reaction Details
TargetComplement factor D
LigandBDBM203865
Substrate/Competitorn/a
Meas. Tech.ChEMBL_1658825 (CHEMBL4008437)
IC50 14000±n/a nM
Citation Vulpetti, ARandl, SRüdisser, SOstermann, NErbel, PMac Sweeney, AZoller, TSalem, BGerhartz, BCumin, FHommel, UDalvit, CLorthiois, EMaibaum, J Structure-Based Library Design and Fragment Screening for the Identification of Reversible Complement Factor D Protease Inhibitors. J Med Chem60:1946-1958 (2017) 
 
Complement factor D
Name:Complement factor D
Type:Protein
Mol. Mass.:27039.19
Organism:Homo sapiens (Human)
Description:P00746
Residue:253
BDBM203865
NameBDBM203865
Synonyms:Methyl (S)-2-((2-((3-(trifluoromethoxy)phenyl)carbamoyl)pyrrolidine-1-carboxamido)-methyl)benzoate (2)
TypeSmall organic molecule
Emp. Form.C22H22F3N3O5
Mol. Mass.465.4224
SMILESCOC(=O)c1ccccc1CNC(=O)N1CCC[C@H]1C(=O)Nc1cccc(OC(F)(F)F)c1