Reaction Details
TargetThioredoxin reductase 1, cytoplasmic
LigandBDBM50236290
Substrate/Competitorn/a
Meas. Tech.ChEMBL_1658998 (CHEMBL4008610)
IC50 8000±n/a nM
Citation Ng, HLMa, XChew, EHChui, WK Design, Synthesis, and Biological Evaluation of Coupled Bioactive Scaffolds as Potential Anticancer Agents for Dual Targeting of Dihydrofolate Reductase and Thioredoxin Reductase. J Med Chem60:1734-1745 (2017) 
 
Thioredoxin reductase 1, cytoplasmic
Name:Thioredoxin reductase 1, cytoplasmic
Type:PROTEIN
Mol. Mass.:54519.34
Organism:Rattus norvegicus
Description:ChEMBL_589950
Residue:498
BDBM50236290
NameBDBM50236290
Synonyms:CHEMBL4083419
TypeSmall organic molecule
Emp. Form.C24H28ClN5O3
Mol. Mass.469.964
SMILESCl.NC1=NC2(CCCC2)N(OCCOc2cccc(c2)C(=O)\C=C\c2ccccc2)C(N)=N1