Reaction Details
TargetThioredoxin reductase 1, cytoplasmic
LigandBDBM50236319
Substrate/Competitorn/a
Meas. Tech.ChEMBL_1658998 (CHEMBL4008610)
IC50 6000±n/a nM
Citation Ng, HLMa, XChew, EHChui, WK Design, Synthesis, and Biological Evaluation of Coupled Bioactive Scaffolds as Potential Anticancer Agents for Dual Targeting of Dihydrofolate Reductase and Thioredoxin Reductase. J Med Chem60:1734-1745 (2017) 
 
Thioredoxin reductase 1, cytoplasmic
Name:Thioredoxin reductase 1, cytoplasmic
Type:PROTEIN
Mol. Mass.:54519.34
Organism:Rattus norvegicus
Description:ChEMBL_589950
Residue:498
BDBM50236319
NameBDBM50236319
Synonyms:CHEMBL4101407
TypeSmall organic molecule
Emp. Form.C24H30ClN5O3
Mol. Mass.471.98
SMILESCl.CC1(C)N=C(N)N=C(N)N1OCCCCOc1cccc(\C=C\C(=O)c2ccccc2)c1