Reaction Details
TargetThioredoxin reductase 1, cytoplasmic
LigandBDBM50236321
Substrate/Competitorn/a
Meas. Tech.ChEMBL_1658999 (CHEMBL4008611)
IC50 4000±n/a nM
Citation Ng, HLMa, XChew, EHChui, WK Design, Synthesis, and Biological Evaluation of Coupled Bioactive Scaffolds as Potential Anticancer Agents for Dual Targeting of Dihydrofolate Reductase and Thioredoxin Reductase. J Med Chem60:1734-1745 (2017) 
 
Thioredoxin reductase 1, cytoplasmic
Name:Thioredoxin reductase 1, cytoplasmic
Type:PROTEIN
Mol. Mass.:54519.34
Organism:Rattus norvegicus
Description:ChEMBL_589950
Residue:498
BDBM50236321
NameBDBM50236321
Synonyms:CHEMBL4097389
TypeSmall organic molecule
Emp. Form.C22H26ClN5O3
Mol. Mass.443.927
SMILESCl.CC1(C)N=C(N)N=C(N)N1OCCOc1cccc(\C=C\C(=O)c2ccccc2)c1