Reaction Details
TargetLysine-specific histone demethylase 1A/REST corepressor 1
LigandBDBM50236400
Substrate/Competitorn/a
Meas. Tech.ChEMBL_1659153 (CHEMBL4008765)
IC50 3500±n/a nM
Citation Sartori, LMercurio, CAmigoni, FCappa, AFagá, GFattori, RLegnaghi, ECiossani, GMattevi, AMeroni, GMoretti, LCecatiello, VPasqualato, SRomussi, AThaler, FTrifiró, PVilla, MVultaggio, SBotrugno, OADessanti, PMinucci, SZagarrí, ECarettoni, DIuzzolino, LVarasi, MVianello, P Thieno[3,2-b]pyrrole-5-carboxamides as New Reversible Inhibitors of Histone Lysine Demethylase KDM1A/LSD1. Part 1: High-Throughput Screening and Preliminary Exploration. J Med Chem60:1673-1692 (2017) 
 
Lysine-specific histone demethylase 1A/REST corepressor 1
Name:Lysine-specific histone demethylase 1A/REST corepressor 1
Synonyms:LSD1/CoREST complex
Type:n/a
Mol. Mass.:n/a
Description:ASSAY_ID of ChEMBL is 1659159
Components:This complex has 2 components.
Component 1
Name:Lysine-specific histone demethylase 1A
Type:Enzyme
Mol. Mass.:92901.01
Organism:Homo sapiens (Human)
Description:O60341
Residue:852
Component 2
Name:REST corepressor 1
Synonyms:KIAA0071 RCOR RCOR1_HUMAN | REST corepressor 1
Type:PROTEIN
Mol. Mass.:53329.34
Organism:Homo sapiens (Human)
Description:ChEMBL_108118
Residue:485
BDBM50236400
NameBDBM50236400
Synonyms:CHEMBL4104004
TypeSmall organic molecule
Emp. Form.C18H13ClN2O4
Mol. Mass.356.76
SMILESCc1oc(cc1C(=O)Nc1ccccc1)-c1ccc(Cl)cc1[N+]([O-])=O