Reaction Details
TargetLysine-specific histone demethylase 2
LigandBDBM50236447
Substrate/Competitorn/a
Meas. Tech.ChEBML_1659184
IC50 16700±n/a nM
Citation Vianello, PSartori, LAmigoni, FCappa, AFagá, GFattori, RLegnaghi, ECiossani, GMattevi, AMeroni, GMoretti, LCecatiello, VPasqualato, SRomussi, AThaler, FTrifiró, PVilla, MBotrugno, OADessanti, PMinucci, SVultaggio, SZagarrí, EVarasi, MMercurio, C Thieno[3,2-b]pyrrole-5-carboxamides as New Reversible Inhibitors of Histone Lysine Demethylase KDM1A/LSD1. Part 2: Structure-Based Drug Design and Structure-Activity Relationship. J Med Chem60:1693-1715 (2017) 
 
Lysine-specific histone demethylase 2
Name:Lysine-specific histone demethylase 2
Type:PROTEIN
Mol. Mass.:92112.91
Organism:Homo sapiens (Human)
Description:ChEMBL_992590
Residue:822
BDBM50236447
NameBDBM50236447
Synonyms:CHEMBL4069817
TypeSmall organic molecule
Emp. Form.C29H33N3O4S
Mol. Mass.519.655
SMILESCCn1c(cc2sccc12)C(=O)Nc1cccc(COC)c1COc1ccc(OC[C@@H]2CCNC2)cc1