Reaction Details
TargetHeat shock protein HSP 90-alpha
LigandBDBM50236522
Substrate/Competitorn/a
Meas. Tech.ChEBML_1659253
IC50 3020±n/a nM
Citation Brough, PABaker, LBedford, SBrown, KChavda, SChell, VD'Alessandro, JDavies, NGDavis, BLe Strat, LMacias, ATMaddox, DMahon, PCMassey, AJMatassova, NMcKenna, SMeissner, JWMoore, JDMurray, JBNorthfield, CJParry, CParsons, RRoughley, SDShaw, TSimmonite, HStokes, SSurgenor, AStefaniak, ERobertson, AWang, YWebb, PWhitehead, NWood, M Application of Off-Rate Screening in the Identification of Novel Pan-Isoform Inhibitors of Pyruvate Dehydrogenase Kinase. J Med Chem60:2271-2286 (2017) 
 
Heat shock protein HSP 90-alpha
Name:Heat shock protein HSP 90-alpha
Type:Molecular Chaperone
Mol. Mass.:84623.45
Organism:Homo sapiens (Human)
Description:P07900
Residue:732
BDBM50236522
NameBDBM50236522
Synonyms:CHEMBL4061698
TypeSmall organic molecule
Emp. Form.C15H15NO4
Mol. Mass.273.2839
SMILESCOc1ccc(cc1)N(C)C(=O)c1ccc(O)cc1O