Reaction Details
TargetHeat shock protein HSP 90-alpha
LigandBDBM50236520
Substrate/Competitorn/a
Meas. Tech.ChEBML_1659253
Ki>50000±n/a nM
Citation Brough, PABaker, LBedford, SBrown, KChavda, SChell, VD'Alessandro, JDavies, NGDavis, BLe Strat, LMacias, ATMaddox, DMahon, PCMassey, AJMatassova, NMcKenna, SMeissner, JWMoore, JDMurray, JBNorthfield, CJParry, CParsons, RRoughley, SDShaw, TSimmonite, HStokes, SSurgenor, AStefaniak, ERobertson, AWang, YWebb, PWhitehead, NWood, M Application of Off-Rate Screening in the Identification of Novel Pan-Isoform Inhibitors of Pyruvate Dehydrogenase Kinase. J Med Chem60:2271-2286 (2017) 
 
Heat shock protein HSP 90-alpha
Name:Heat shock protein HSP 90-alpha
Type:Molecular Chaperone
Mol. Mass.:84623.45
Organism:Homo sapiens (Human)
Description:P07900
Residue:732
BDBM50236520
NameBDBM50236520
Synonyms:CHEMBL3717438
TypeSmall organic molecule
Emp. Form.C26H21ClN4O3
Mol. Mass.472.923
SMILESCc1cnc(Cl)nc1-c1ccc2N([C@H](CCc2c1)c1cccnc1)C(=O)c1ccc(O)cc1O