Reaction Details
Target[Pyruvate dehydrogenase (acetyl-transferring)] kinase isozyme 1, mitochondrial
LigandBDBM50236533
Substrate/Competitorn/a
Meas. Tech.ChEMBL_1659262 (CHEMBL4008874)
IC50 66±n/a nM
Citation Brough, PABaker, LBedford, SBrown, KChavda, SChell, VD'Alessandro, JDavies, NGDavis, BLe Strat, LMacias, ATMaddox, DMahon, PCMassey, AJMatassova, NMcKenna, SMeissner, JWMoore, JDMurray, JBNorthfield, CJParry, CParsons, RRoughley, SDShaw, TSimmonite, HStokes, SSurgenor, AStefaniak, ERobertson, AWang, YWebb, PWhitehead, NWood, M Application of Off-Rate Screening in the Identification of Novel Pan-Isoform Inhibitors of Pyruvate Dehydrogenase Kinase. J Med Chem60:2271-2286 (2017) 
 
[Pyruvate dehydrogenase (acetyl-transferring)] kinase isozyme 1, mitochondrial
Name:[Pyruvate dehydrogenase (acetyl-transferring)] kinase isozyme 1, mitochondrial
Type:Protein
Mol. Mass.:49255.23
Organism:Homo sapiens (Human)
Description:Q15118
Residue:436
BDBM50236533
NameBDBM50236533
Synonyms:CHEMBL316388
TypeSmall organic molecule
Emp. Form.C18H20F3N3O3
Mol. Mass.383.3649
SMILESC[C@@H]1CN([C@@H](C)CN1C(=O)c1ccc(cc1)C#N)C(=O)[C@@](C)(O)C(F)(F)F