Reaction Details
Target[Pyruvate dehydrogenase (acetyl-transferring)] kinase isozyme 1, mitochondrial
LigandBDBM50236514
Substrate/Competitorn/a
Meas. Tech.ChEMBL_1659262 (CHEMBL4008874)
IC50 2740±n/a nM
Citation Brough, PABaker, LBedford, SBrown, KChavda, SChell, VD'Alessandro, JDavies, NGDavis, BLe Strat, LMacias, ATMaddox, DMahon, PCMassey, AJMatassova, NMcKenna, SMeissner, JWMoore, JDMurray, JBNorthfield, CJParry, CParsons, RRoughley, SDShaw, TSimmonite, HStokes, SSurgenor, AStefaniak, ERobertson, AWang, YWebb, PWhitehead, NWood, M Application of Off-Rate Screening in the Identification of Novel Pan-Isoform Inhibitors of Pyruvate Dehydrogenase Kinase. J Med Chem60:2271-2286 (2017) 
 
[Pyruvate dehydrogenase (acetyl-transferring)] kinase isozyme 1, mitochondrial
Name:[Pyruvate dehydrogenase (acetyl-transferring)] kinase isozyme 1, mitochondrial
Type:Protein
Mol. Mass.:49255.23
Organism:Homo sapiens (Human)
Description:Q15118
Residue:436
BDBM50236514
NameBDBM50236514
Synonyms:CHEMBL4100504
TypeSmall organic molecule
Emp. Form.C22H20ClN3O3
Mol. Mass.409.866
SMILESC[C@H]1CCc2cc(ccc2N1C(=O)c1ccc(O)cc1O)-c1nc(Cl)ncc1C