Reaction Details
Target[Pyruvate dehydrogenase (acetyl-transferring)] kinase isozyme 4, mitochondrial
LigandBDBM50236522
Substrate/Competitorn/a
Meas. Tech.ChEMBL_1659257 (CHEMBL4008869)
Ki 1270±n/a nM
Citation Brough, PABaker, LBedford, SBrown, KChavda, SChell, VD'Alessandro, JDavies, NGDavis, BLe Strat, LMacias, ATMaddox, DMahon, PCMassey, AJMatassova, NMcKenna, SMeissner, JWMoore, JDMurray, JBNorthfield, CJParry, CParsons, RRoughley, SDShaw, TSimmonite, HStokes, SSurgenor, AStefaniak, ERobertson, AWang, YWebb, PWhitehead, NWood, M Application of Off-Rate Screening in the Identification of Novel Pan-Isoform Inhibitors of Pyruvate Dehydrogenase Kinase. J Med Chem60:2271-2286 (2017) 
 
[Pyruvate dehydrogenase (acetyl-transferring)] kinase isozyme 4, mitochondrial
Name:[Pyruvate dehydrogenase (acetyl-transferring)] kinase isozyme 4, mitochondrial
Type:Enzyme
Mol. Mass.:46469.71
Organism:Homo sapiens (Human)
Description:Q16654
Residue:411
BDBM50236522
NameBDBM50236522
Synonyms:CHEMBL4061698
TypeSmall organic molecule
Emp. Form.C15H15NO4
Mol. Mass.273.2839
SMILESCOc1ccc(cc1)N(C)C(=O)c1ccc(O)cc1O