Reaction Details
Target[Pyruvate dehydrogenase (acetyl-transferring)] kinase isozyme 2, mitochondrial
LigandBDBM50236530
Substrate/Competitorn/a
Meas. Tech.ChEMBL_1659265 (CHEMBL4008877)
IC50 84±n/a nM
Citation Brough, PABaker, LBedford, SBrown, KChavda, SChell, VD'Alessandro, JDavies, NGDavis, BLe Strat, LMacias, ATMaddox, DMahon, PCMassey, AJMatassova, NMcKenna, SMeissner, JWMoore, JDMurray, JBNorthfield, CJParry, CParsons, RRoughley, SDShaw, TSimmonite, HStokes, SSurgenor, AStefaniak, ERobertson, AWang, YWebb, PWhitehead, NWood, M Application of Off-Rate Screening in the Identification of Novel Pan-Isoform Inhibitors of Pyruvate Dehydrogenase Kinase. J Med Chem60:2271-2286 (2017) 
 
[Pyruvate dehydrogenase (acetyl-transferring)] kinase isozyme 2, mitochondrial
Name:[Pyruvate dehydrogenase (acetyl-transferring)] kinase isozyme 2, mitochondrial
Type:Enzyme
Mol. Mass.:46153.78
Organism:Homo sapiens (Human)
Description:Q15119
Residue:407
BDBM50236530
NameBDBM50236530
Synonyms:CHEMBL3727577
TypeSmall organic molecule
Emp. Form.C28H23ClF2N4O4
Mol. Mass.552.956
SMILESCc1cnc(Cl)nc1-c1ccc(cc1)N(Cc1ccc(CNC(=O)C(F)F)cc1)C(=O)c1ccc(O)cc1O