Reaction Details
TargetDual specificity tyrosine-phosphorylation-regulated kinase 2
LigandBDBM50236548
Substrate/Competitorn/a
Meas. Tech.ChEMBL_1659282 (CHEMBL4008894)
IC50>1000±n/a nM
Citation Zhou, QPhoa, AFAbbassi, RHHoque, MReekie, TAFont, JSRyan, RMStringer, BWDay, BWJohns, TGMunoz, LKassiou, M Structural Optimization and Pharmacological Evaluation of Inhibitors Targeting Dual-Specificity Tyrosine Phosphorylation-Regulated Kinases (DYRK) and CDC-like kinases (CLK) in Glioblastoma. J Med Chem60:2052-2070 (2017) 
 
Dual specificity tyrosine-phosphorylation-regulated kinase 2
Name:Dual specificity tyrosine-phosphorylation-regulated kinase 2
Type:PROTEIN
Mol. Mass.:66690.69
Organism:Homo sapiens (Human)
Description:ChEMBL_1508025
Residue:601
BDBM50236548
NameBDBM50236548
Synonyms:CHEMBL4097535
TypeSmall organic molecule
Emp. Form.C20H15N3O3
Mol. Mass.345.3514
SMILESOc1ccc(cc1)-c1cnc2[nH]cc(C(=O)Nc3cccc(O)c3)c2c1