Reaction Details
TargetDual specificity tyrosine-phosphorylation-regulated kinase 1B
LigandBDBM50236545
Substrate/Competitorn/a
Meas. Tech.ChEBML_1659284
IC50 42±n/a nM
Citation Zhou, QPhoa, AFAbbassi, RHHoque, MReekie, TAFont, JSRyan, RMStringer, BWDay, BWJohns, TGMunoz, LKassiou, M Structural Optimization and Pharmacological Evaluation of Inhibitors Targeting Dual-Specificity Tyrosine Phosphorylation-Regulated Kinases (DYRK) and CDC-like kinases (CLK) in Glioblastoma. J Med Chem60:2052-2070 (2017) 
 
Dual specificity tyrosine-phosphorylation-regulated kinase 1B
Name:Dual specificity tyrosine-phosphorylation-regulated kinase 1B
Type:Enzyme
Mol. Mass.:69222.24
Organism:Homo sapiens (Human)
Description:Q9Y463
Residue:629
BDBM50236545
NameBDBM50236545
Synonyms:CHEMBL4087125
TypeSmall organic molecule
Emp. Form.C20H14N6O
Mol. Mass.354.3648
SMILESOc1ccc(cc1)-c1c[nH]c2ncc(cc12)-c1ccc(cc1)-c1nnn[nH]1