Reaction Details
TargetDual specificity tyrosine-phosphorylation-regulated kinase 1B
LigandBDBM50236539
Substrate/Competitorn/a
Meas. Tech.ChEMBL_1659284 (CHEMBL4008896)
IC50>1000±n/a nM
Citation Zhou, QPhoa, AFAbbassi, RHHoque, MReekie, TAFont, JSRyan, RMStringer, BWDay, BWJohns, TGMunoz, LKassiou, M Structural Optimization and Pharmacological Evaluation of Inhibitors Targeting Dual-Specificity Tyrosine Phosphorylation-Regulated Kinases (DYRK) and CDC-like kinases (CLK) in Glioblastoma. J Med Chem60:2052-2070 (2017) 
 
Dual specificity tyrosine-phosphorylation-regulated kinase 1B
Name:Dual specificity tyrosine-phosphorylation-regulated kinase 1B
Type:Enzyme
Mol. Mass.:69222.24
Organism:Homo sapiens (Human)
Description:Q9Y463
Residue:629
BDBM50236539
NameBDBM50236539
Synonyms:CHEMBL4073972
TypeSmall organic molecule
Emp. Form.C20H15NO2
Mol. Mass.301.3386
SMILESOc1ccc(cc1)-c1c[nH]c2ccc(cc12)-c1ccc(O)cc1