Reaction Details
TargetDual specificity protein kinase CLK1
LigandBDBM50236542
Substrate/Competitorn/a
Meas. Tech.ChEMBL_1659285 (CHEMBL4008897)
EC50 44000±n/a nM
Citation Zhou, QPhoa, AFAbbassi, RHHoque, MReekie, TAFont, JSRyan, RMStringer, BWDay, BWJohns, TGMunoz, LKassiou, M Structural Optimization and Pharmacological Evaluation of Inhibitors Targeting Dual-Specificity Tyrosine Phosphorylation-Regulated Kinases (DYRK) and CDC-like kinases (CLK) in Glioblastoma. J Med Chem60:2052-2070 (2017) 
 
Dual specificity protein kinase CLK1
Name:Dual specificity protein kinase CLK1
Type:Protein
Mol. Mass.:57322.21
Organism:Homo sapiens (Human)
Description:P49759
Residue:484
BDBM50236542
NameBDBM50236542
Synonyms:CHEMBL4088888
TypeSmall organic molecule
Emp. Form.C20H17N3O3S
Mol. Mass.379.432
SMILESCS(=O)(=O)Nc1ccc(cc1)-c1cnc2[nH]cc(-c3ccc(O)cc3)c2c1