Reaction Details
TargetDual specificity tyrosine-phosphorylation-regulated kinase 1A
LigandBDBM50236544
Substrate/Competitorn/a
Meas. Tech.ChEMBL_1659283 (CHEMBL4008895)
IC50 43±n/a nM
Citation Zhou, QPhoa, AFAbbassi, RHHoque, MReekie, TAFont, JSRyan, RMStringer, BWDay, BWJohns, TGMunoz, LKassiou, M Structural Optimization and Pharmacological Evaluation of Inhibitors Targeting Dual-Specificity Tyrosine Phosphorylation-Regulated Kinases (DYRK) and CDC-like kinases (CLK) in Glioblastoma. J Med Chem60:2052-2070 (2017) 
 
Dual specificity tyrosine-phosphorylation-regulated kinase 1A
Name:Dual specificity tyrosine-phosphorylation-regulated kinase 1A
Type:Enzyme
Mol. Mass.:85616.61
Organism:Homo sapiens (Human)
Description:Q13627
Residue:763
BDBM50236544
NameBDBM50236544
Synonyms:CHEMBL4096575
TypeSmall organic molecule
Emp. Form.C19H15N3O
Mol. Mass.301.3419
SMILESNc1ccc(cc1)-c1cnc2[nH]cc(-c3ccc(O)cc3)c2c1