Reaction Details
Target5-hydroxytryptamine receptor 2A
LigandBDBM50236715
Substrate/Competitorn/a
Meas. Tech.ChEMBL_1660350 (CHEMBL4009962)
Ki 0.130000±n/a nM
Citation Glennon, RA The 2014 Philip S. Portoghese Medicinal Chemistry Lectureship: The"Phenylalkylaminome" with a Focus on Selected Drugs of Abuse. J Med Chem60:2605-2628 (2017) 
 
5-hydroxytryptamine receptor 2A
Name:5-hydroxytryptamine receptor 2A
Type:G Protein-Coupled Receptor (GPCR)
Mol. Mass.:52852.05
Organism:Rattus norvegicus (rat)
Description:Rat cortex membranes 5-HT2A receptors.
Residue:471
BDBM50236715
NameBDBM50236715
Synonyms:CHEMBL4067210
TypeSmall organic molecule
Emp. Form.C13H17N3O
Mol. Mass.231.2936
SMILESC[C@H](N)Cn1ncc2ccc3OCCCc3c12