Reaction Details
TargetSigma non-opioid intracellular receptor 1
LigandBDBM50236730
Substrate/Competitorn/a
Meas. Tech.ChEMBL_1660368 (CHEMBL4009980)
Ki 0.140000±n/a nM
Citation Glennon, RA The 2014 Philip S. Portoghese Medicinal Chemistry Lectureship: The"Phenylalkylaminome" with a Focus on Selected Drugs of Abuse. J Med Chem60:2605-2628 (2017) 
 
Sigma non-opioid intracellular receptor 1
Name:Sigma non-opioid intracellular receptor 1
Type:Protein
Mol. Mass.:25307.17
Organism:Cavia porcellus (Guinea pig)
Description:Q60492
Residue:223
BDBM50236730
NameBDBM50236730
Synonyms:CHEMBL4072342
TypeSmall organic molecule
Emp. Form.C22H29N
Mol. Mass.307.4724
SMILESC(CCN1CCCC(C1)c1ccccc1)CCc1ccccc1