Reaction Details
TargetD(2) dopamine receptor
LigandBDBM50237164
Substrate/Competitorn/a
Meas. Tech.ChEMBL_1660541 (CHEMBL4010153)
Ki 0.520000±n/a nM
Citation Möller, DBanerjee, AUzuneser, TCSkultety, MHuth, TPlouffe, BHübner, HAlzheimer, CFriedland, KMüller, CPBouvier, MGmeiner, P Discovery of G Protein-Biased Dopaminergics with a Pyrazolo[1,5-a]pyridine Substructure. J Med Chem60:2908-2929 (2017) 
 
D(2) dopamine receptor
Name:D(2) dopamine receptor
Type:Cell-surface receptors
Mol. Mass.:50647.10
Organism:Homo sapiens (Human)
Description:P14416
Residue:443
BDBM50237164
NameBDBM50237164
Synonyms:CHEMBL4091064
TypeSmall organic molecule
Emp. Form.C22H22Cl2N6O
Mol. Mass.457.356
SMILESClc1cccc(N2CCN(CCCC(=O)Nc3ccn4ncc(C#N)c4c3)CC2)c1Cl