Reaction Details
TargetD(3) dopamine receptor
LigandBDBM50236960
Substrate/Competitorn/a
Meas. Tech.ChEBML_1660549
Ki 1.7±n/a nM
Citation Möller, DBanerjee, AUzuneser, TCSkultety, MHuth, TPlouffe, BHübner, HAlzheimer, CFriedland, KMüller, CPBouvier, MGmeiner, P Discovery of G Protein-Biased Dopaminergics with a Pyrazolo[1,5-a]pyridine Substructure. J Med Chem60:2908-2929 (2017) 
 
D(3) dopamine receptor
Name:D(3) dopamine receptor
Type:n/a
Mol. Mass.:44243.43
Organism:Homo sapiens (Human)
Description:n/a
Residue:400
BDBM50236960
NameBDBM50236960
Synonyms:CHEMBL4060403
TypeSmall organic molecule
Emp. Form.C22H23Cl2N5O2
Mol. Mass.460.356
SMILESClc1cccc(N2CCN(CCCC(=O)Nc3ccn4ncc(C=O)c4c3)CC2)c1Cl