Reaction Details
TargetD(2) dopamine receptor
LigandBDBM50236961
Substrate/Competitorn/a
Meas. Tech.ChEMBL_1660544 (CHEMBL4010156)
Ki 0.250000±n/a nM
Citation Möller, DBanerjee, AUzuneser, TCSkultety, MHuth, TPlouffe, BHübner, HAlzheimer, CFriedland, KMüller, CPBouvier, MGmeiner, P Discovery of G Protein-Biased Dopaminergics with a Pyrazolo[1,5-a]pyridine Substructure. J Med Chem60:2908-2929 (2017) 
 
D(2) dopamine receptor
Name:D(2) dopamine receptor
Type:Cell-surface receptors
Mol. Mass.:50647.10
Organism:Homo sapiens (Human)
Description:P14416
Residue:443
BDBM50236961
NameBDBM50236961
Synonyms:CHEMBL4063235
TypeSmall organic molecule
Emp. Form.C23H27N5O2
Mol. Mass.405.4928
SMILESCOc1ccccc1N1CCN(CCCCOc2ccn3ncc(C#N)c3c2)CC1