Reaction Details
Target5-hydroxytryptamine receptor 6
LigandBDBM50236793
Substrate/Competitorn/a
Meas. Tech.ChEMBL_1659425 (CHEMBL4009037)
Ki 8.8±n/a nM
Citation Nirogi, RShinde, AKambhampati, RSMohammed, ARSaraf, SKBadange, RKBandyala, TRBhatta, VBojja, KReballi, VSubramanian, RBenade, VPalacharla, RCBhyrapuneni, GJayarajan, PGoyal, VJasti, V Discovery and Development of 1-[(2-Bromophenyl)sulfonyl]-5-methoxy-3-[(4-methyl-1-piperazinyl)methyl]-1H-indole Dimesylate Monohydrate (SUVN-502): A Novel, Potent, Selective and Orally Active Serotonin 6 (5-HT J Med Chem60:1843-1859 (2017) 
 
5-hydroxytryptamine receptor 6
Name:5-hydroxytryptamine receptor 6
Type:G Protein-Coupled Receptor (GPCR)
Mol. Mass.:46968.43
Organism:Homo sapiens (Human)
Description:P50406
Residue:440
BDBM50236793
NameBDBM50236793
Synonyms:CHEMBL4064478
TypeSmall organic molecule
Emp. Form.C22H27N3O3S
Mol. Mass.413.533
SMILESCCN1CCN(Cc2cn(c3ccc(OC)cc23)S(=O)(=O)c2ccccc2)CC1