Reaction Details
Target5-hydroxytryptamine receptor 6
LigandBDBM50236846
Substrate/Competitorn/a
Meas. Tech.ChEMBL_1659425 (CHEMBL4009037)
Ki 1.3±n/a nM
Citation Nirogi, RShinde, AKambhampati, RSMohammed, ARSaraf, SKBadange, RKBandyala, TRBhatta, VBojja, KReballi, VSubramanian, RBenade, VPalacharla, RCBhyrapuneni, GJayarajan, PGoyal, VJasti, V Discovery and Development of 1-[(2-Bromophenyl)sulfonyl]-5-methoxy-3-[(4-methyl-1-piperazinyl)methyl]-1H-indole Dimesylate Monohydrate (SUVN-502): A Novel, Potent, Selective and Orally Active Serotonin 6 (5-HT J Med Chem60:1843-1859 (2017) 
 
5-hydroxytryptamine receptor 6
Name:5-hydroxytryptamine receptor 6
Type:G Protein-Coupled Receptor (GPCR)
Mol. Mass.:46968.43
Organism:Homo sapiens (Human)
Description:P50406
Residue:440
BDBM50236846
NameBDBM50236846
Synonyms:CHEMBL4080401
TypeSmall organic molecule
Emp. Form.C22H34BrN3O11S3
Mol. Mass.692.618
SMILESO.O.CS(O)(=O)=O.CS(O)(=O)=O.COc1ccc2n(cc(CN3CCNCC3)c2c1)S(=O)(=O)c1ccccc1Br