Reaction Details
Target5-hydroxytryptamine receptor 6
LigandBDBM50236756
Substrate/Competitorn/a
Meas. Tech.ChEMBL_1659425 (CHEMBL4009037)
Ki 2±n/a nM
Citation Nirogi, RShinde, AKambhampati, RSMohammed, ARSaraf, SKBadange, RKBandyala, TRBhatta, VBojja, KReballi, VSubramanian, RBenade, VPalacharla, RCBhyrapuneni, GJayarajan, PGoyal, VJasti, V Discovery and Development of 1-[(2-Bromophenyl)sulfonyl]-5-methoxy-3-[(4-methyl-1-piperazinyl)methyl]-1H-indole Dimesylate Monohydrate (SUVN-502): A Novel, Potent, Selective and Orally Active Serotonin 6 (5-HT J Med Chem60:1843-1859 (2017) 
 
5-hydroxytryptamine receptor 6
Name:5-hydroxytryptamine receptor 6
Type:G Protein-Coupled Receptor (GPCR)
Mol. Mass.:46968.43
Organism:Homo sapiens (Human)
Description:P50406
Residue:440
BDBM50236756
NameBDBM50236756
Synonyms:CHEMBL4101284
TypeSmall organic molecule
Emp. Form.C25H35Cl2N3O3S
Mol. Mass.528.535
SMILESCl.Cl.COc1ccc2n(cc(CN3CCCN(C)CC3)c2c1)S(=O)(=O)c1ccc(cc1)C(C)C