Reaction Details
Target5-hydroxytryptamine receptor 6
LigandBDBM50236832
Substrate/Competitorn/a
Meas. Tech.ChEMBL_1659425 (CHEMBL4009037)
Ki 4±n/a nM
Citation Nirogi, RShinde, AKambhampati, RSMohammed, ARSaraf, SKBadange, RKBandyala, TRBhatta, VBojja, KReballi, VSubramanian, RBenade, VPalacharla, RCBhyrapuneni, GJayarajan, PGoyal, VJasti, V Discovery and Development of 1-[(2-Bromophenyl)sulfonyl]-5-methoxy-3-[(4-methyl-1-piperazinyl)methyl]-1H-indole Dimesylate Monohydrate (SUVN-502): A Novel, Potent, Selective and Orally Active Serotonin 6 (5-HT J Med Chem60:1843-1859 (2017) 
 
5-hydroxytryptamine receptor 6
Name:5-hydroxytryptamine receptor 6
Type:G Protein-Coupled Receptor (GPCR)
Mol. Mass.:46968.43
Organism:Homo sapiens (Human)
Description:P50406
Residue:440
BDBM50236832
NameBDBM50236832
Synonyms:CHEMBL4093699
TypeSmall organic molecule
Emp. Form.C23H30Cl2FN3O2S
Mol. Mass.502.473
SMILESCl.Cl.CC(C)c1ccc(cc1)S(=O)(=O)n1cc(CN2CCN(C)CC2)c2cc(F)ccc12