Reaction Details
Target5-hydroxytryptamine receptor 6
LigandBDBM50044616
Substrate/Competitorn/a
Meas. Tech.ChEMBL_1659500 (CHEMBL4009112)
Ki 1.3±n/a nM
Citation Nirogi, RShinde, AKambhampati, RSMohammed, ARSaraf, SKBadange, RKBandyala, TRBhatta, VBojja, KReballi, VSubramanian, RBenade, VPalacharla, RCBhyrapuneni, GJayarajan, PGoyal, VJasti, V Discovery and Development of 1-[(2-Bromophenyl)sulfonyl]-5-methoxy-3-[(4-methyl-1-piperazinyl)methyl]-1H-indole Dimesylate Monohydrate (SUVN-502): A Novel, Potent, Selective and Orally Active Serotonin 6 (5-HT J Med Chem60:1843-1859 (2017) 
 
5-hydroxytryptamine receptor 6
Name:5-hydroxytryptamine receptor 6
Type:G Protein-Coupled Receptor (GPCR)
Mol. Mass.:46968.43
Organism:Homo sapiens (Human)
Description:P50406
Residue:440
BDBM50044616
NameBDBM50044616
Synonyms:Cerlapirdine SAM-531 | WAY-262531
TypeSmall organic molecule
Emp. Form.C22H23N3O3S
Mol. Mass.409.501
SMILESCN(C)CCCOc1ccc2[nH]nc(c2c1)S(=O)(=O)c1cccc2ccccc12