Reaction Details
TargetKappa-type opioid receptor
LigandBDBM50236871
Substrate/Competitorn/a
Meas. Tech.ChEMBL_1659540 (CHEMBL4009152)
EC50 3.7±n/a nM
Citation Soeberdt, MMolenveld, PStorcken, RPBouzanne des Mazery, RSterk, GJAutar, RBolster, MGWagner, CAerts, SNvan Holst, FRWegert, ATangherlini, GFrehland, BSchepmann, DMetze, DLotts, TKnie, ULin, KYHuang, TYLai, CCStänder, SWünsch, BAbels, C Design and Synthesis of Enantiomerically Pure Decahydroquinoxalines as Potent and Selective¿-Opioid Receptor Agonists with Anti-Inflammatory Activity in Vivo. J Med Chem60:2526-2551 (2017) 
 
Kappa-type opioid receptor
Name:Kappa-type opioid receptor
Type:G Protein-Coupled Receptor (GPCR)
Mol. Mass.:42648.76
Organism:Homo sapiens (Human)
Description:P41145
Residue:380
BDBM50236871
NameBDBM50236871
Synonyms:CHEMBL4069231
TypeSmall organic molecule
Emp. Form.C20H27Cl2N3O
Mol. Mass.396.354
SMILES[H][C@]12CCC[C@H](N3CCCC3)[C@@]1([H])N(CCN2)C(=O)Cc1ccc(Cl)c(Cl)c1