Reaction Details
TargetKappa-type opioid receptor
LigandBDBM50236879
Substrate/Competitorn/a
Meas. Tech.ChEMBL_1659529 (CHEMBL4009141)
Ki 0.820000±n/a nM
Citation Soeberdt, MMolenveld, PStorcken, RPBouzanne des Mazery, RSterk, GJAutar, RBolster, MGWagner, CAerts, SNvan Holst, FRWegert, ATangherlini, GFrehland, BSchepmann, DMetze, DLotts, TKnie, ULin, KYHuang, TYLai, CCStänder, SWünsch, BAbels, C Design and Synthesis of Enantiomerically Pure Decahydroquinoxalines as Potent and Selective¿-Opioid Receptor Agonists with Anti-Inflammatory Activity in Vivo. J Med Chem60:2526-2551 (2017) 
 
Kappa-type opioid receptor
Name:Kappa-type opioid receptor
Type:G Protein-Coupled Receptor (GPCR)
Mol. Mass.:42744.99
Organism:Cavia porcellus (domestic guinea pig)
Description:P41144
Residue:380
BDBM50236879
NameBDBM50236879
Synonyms:CHEMBL4069149
TypeSmall organic molecule
Emp. Form.C24H30ClFN4O5S
Mol. Mass.541.035
SMILES[H][C@]12CCC[C@H](N3CC[C@H](O)C3)[C@@]1([H])N(CCN2S(=O)(=O)Cc1ccon1)C(=O)Cc1ccc(Cl)c(F)c1