Reaction Details
TargetKappa-type opioid receptor
LigandBDBM50236882
Substrate/Competitorn/a
Meas. Tech.ChEMBL_1659540 (CHEMBL4009152)
EC50 6.9±n/a nM
Citation Soeberdt, MMolenveld, PStorcken, RPBouzanne des Mazery, RSterk, GJAutar, RBolster, MGWagner, CAerts, SNvan Holst, FRWegert, ATangherlini, GFrehland, BSchepmann, DMetze, DLotts, TKnie, ULin, KYHuang, TYLai, CCStänder, SWünsch, BAbels, C Design and Synthesis of Enantiomerically Pure Decahydroquinoxalines as Potent and Selective¿-Opioid Receptor Agonists with Anti-Inflammatory Activity in Vivo. J Med Chem60:2526-2551 (2017) 
 
Kappa-type opioid receptor
Name:Kappa-type opioid receptor
Type:G Protein-Coupled Receptor (GPCR)
Mol. Mass.:42648.76
Organism:Homo sapiens (Human)
Description:P41145
Residue:380
BDBM50236882
NameBDBM50236882
Synonyms:CHEMBL4096405
TypeSmall organic molecule
Emp. Form.C24H31ClN4O5S
Mol. Mass.523.045
SMILES[H][C@]12CCC[C@H](N3CC[C@H](O)C3)[C@@]1([H])N(CCN2S(=O)(=O)Cc1ccon1)C(=O)Cc1ccc(Cl)cc1