Reaction Details
TargetRetinal dehydrogenase 2
LigandBDBM50236899
Substrate/Competitorn/a
Meas. Tech.ChEMBL_1659727 (CHEMBL4009339)
IC50 300±n/a nM
Citation Buchman, CDHurley, TD Inhibition of the Aldehyde Dehydrogenase 1/2 Family by Psoralen and Coumarin Derivatives. J Med Chem60:2439-2455 (2017) 
 
Retinal dehydrogenase 2
Name:Retinal dehydrogenase 2
Type:PROTEIN
Mol. Mass.:56720.77
Organism:Homo sapiens (Human)
Description:ChEMBL_109700
Residue:518
BDBM50236899
NameBDBM50236899
Synonyms:CHEMBL4099822
TypeSmall organic molecule
Emp. Form.C17H18O3
Mol. Mass.270.323
SMILESCCCc1c(C)c2cc3c(C)c(C)oc3cc2oc1=O