Reaction Details
TargetAldehyde dehydrogenase 1A1
LigandBDBM50236909
Substrate/Competitorn/a
Meas. Tech.ChEMBL_1659725 (CHEMBL4009337)
IC50 130±n/a nM
Citation Buchman, CDHurley, TD Inhibition of the Aldehyde Dehydrogenase 1/2 Family by Psoralen and Coumarin Derivatives. J Med Chem60:2439-2455 (2017) 
 
Aldehyde dehydrogenase 1A1
Name:Aldehyde dehydrogenase 1A1
Type:Protein
Mol. Mass.:54862.21
Organism:Homo sapiens (Human)
Description:n/a
Residue:501
BDBM50236909
NameBDBM50236909
Synonyms:CHEMBL4090473
TypeSmall organic molecule
Emp. Form.C17H16O3
Mol. Mass.268.3071
SMILESCc1oc2cc3oc(=O)c4CCCCc4c3cc2c1C