Reaction Details
TargetAldehyde dehydrogenase 1A1
LigandBDBM50303403
Substrate/Competitorn/a
Meas. Tech.ChEMBL_1659743 (CHEMBL4009355)
Ki 6900±n/a nM
Citation Buchman, CDHurley, TD Inhibition of the Aldehyde Dehydrogenase 1/2 Family by Psoralen and Coumarin Derivatives. J Med Chem60:2439-2455 (2017) 
 
Aldehyde dehydrogenase 1A1
Name:Aldehyde dehydrogenase 1A1
Type:Protein
Mol. Mass.:54862.21
Organism:Homo sapiens (Human)
Description:n/a
Residue:501
BDBM50303403
NameBDBM50303403
Synonyms:2-(4-methyl-2-oxo-2H-chromen-7-yloxy)acetonitrile cid_1633306
TypeSmall organic molecule
Emp. Form.C12H9NO3
Mol. Mass.215.2048
SMILESCc1cc(=O)oc2cc(OCC#N)ccc12