Reaction Details
TargetFocal adhesion kinase 1
LigandBDBM50236991
Substrate/Competitorn/a
Meas. Tech.ChEMBL_1661305 (CHEMBL4010917)
IC50 2500±n/a nM
Citation Dao, PLietha, DEtheve-Quelquejeu, MGarbay, CChen, H Synthesis of novel 1,2,4-triazine scaffold as FAK inhibitors with antitumor activity. Bioorg Med Chem Lett27:1727-1730 (2017) 
 
Focal adhesion kinase 1
Name:Focal adhesion kinase 1
Type:Tyrosine-protein kinase
Mol. Mass.:119233.17
Organism:Homo sapiens (Human)
Description:Q05397
Residue:1052
BDBM50236991
NameBDBM50236991
Synonyms:CHEMBL4060227
TypeSmall organic molecule
Emp. Form.C19H21ClN6O5S
Mol. Mass.480.925
SMILESCOc1cc(Nc2nnc(Cl)c(Nc3cccc(NS(C)(=O)=O)c3)n2)cc(OC)c1OC