Reaction Details
TargetProcathepsin L
LigandBDBM50237025
Substrate/Competitorn/a
Meas. Tech.ChEMBL_1661378 (CHEMBL4010990)
Ki 505±n/a nM
Citation Kuhn, BTichư, MWang, LRobinson, SMartin, REKuglstatter, ABenz, JGiroud, MSchirmeister, TAbel, RDiederich, FHert, J Prospective Evaluation of Free Energy Calculations for the Prioritization of Cathepsin L Inhibitors. J Med Chem60:2485-2497 (2017) 
 
Procathepsin L
Name:Procathepsin L
Type:Enzyme
Mol. Mass.:37557.19
Organism:Homo sapiens (Human)
Description:Purchased from Calbiochem (San Diego, CA).
Residue:333
BDBM50237025
NameBDBM50237025
Synonyms:CHEMBL4093759
TypeSmall organic molecule
Emp. Form.C20H16FN5O2
Mol. Mass.377.3717
SMILESFc1cnc(nc1N(CCc1ccncc1)Cc1ccc2OCOc2c1)C#N