Reaction Details
TargetEpidermal growth factor receptor
LigandBDBM50237140
Substrate/Competitorn/a
Meas. Tech.ChEMBL_1659921 (CHEMBL4009533)
Ki 5.1±n/a nM
Citation Tomassi, SLategahn, JEngel, JKeul, MTumbrink, HLKetzer, JMühlenberg, TBaumann, MSchultz-Fademrecht, CBauer, SRauh, D Indazole-Based Covalent Inhibitors To Target Drug-Resistant Epidermal Growth Factor Receptor. J Med Chem60:2361-2372 (2017) 
 
Epidermal growth factor receptor
Name:Epidermal growth factor receptor
Type:Receptor Kinase Domain
Mol. Mass.:134279.59
Organism:Homo sapiens (Human)
Description:P00533
Residue:1210
BDBM50237140
NameBDBM50237140
Synonyms:CHEMBL4068763
TypeSmall organic molecule
Emp. Form.C28H32FN7O2
Mol. Mass.517.5978
SMILESCOc1cc(N(C)CCN(C)C)c(NC(=O)C=C)cc1Nc1n[nH]c2cc(Nc3cccc(F)c3)ccc12