Reaction Details
TargetEpidermal growth factor receptor
LigandBDBM50237153
Substrate/Competitorn/a
Meas. Tech.ChEMBL_1659921 (CHEMBL4009533)
Ki 236±n/a nM
Citation Tomassi, SLategahn, JEngel, JKeul, MTumbrink, HLKetzer, JMühlenberg, TBaumann, MSchultz-Fademrecht, CBauer, SRauh, D Indazole-Based Covalent Inhibitors To Target Drug-Resistant Epidermal Growth Factor Receptor. J Med Chem60:2361-2372 (2017) 
 
Epidermal growth factor receptor
Name:Epidermal growth factor receptor
Type:Receptor Kinase Domain
Mol. Mass.:134279.59
Organism:Homo sapiens (Human)
Description:P00533
Residue:1210
BDBM50237153
NameBDBM50237153
Synonyms:CHEMBL4098444
TypeSmall organic molecule
Emp. Form.C31H35N7O2
Mol. Mass.537.6553
SMILESCOc1cc(N(C)CCN(C)C)c(NC(=O)C=C)cc1Nc1n[nH]c2cc(ccc12)-c1cn(C)c2ccccc12