Reaction Details
TargetCarbonic anhydrase 1
LigandBDBM50237171
Substrate/Competitorn/a
Meas. Tech.ChEBML_1660629
Ki 8550±n/a nM
Citation Mishra, CBKumari, SAngeli, AMonti, SMBuonanno, MTiwari, MSupuran, CT Discovery of Benzenesulfonamides with Potent Human Carbonic Anhydrase Inhibitory and Effective Anticonvulsant Action: Design, Synthesis, and Pharmacological Assessment. J Med Chem60:2456-2469 (2017) 
 
Carbonic anhydrase 1
Name:Carbonic anhydrase 1
Type:Enzyme
Mol. Mass.:28873.37
Organism:Homo sapiens (Human)
Description:P00915
Residue:261
BDBM50237171
NameBDBM50237171
Synonyms:CHEMBL4083316
TypeSmall organic molecule
Emp. Form.C20H24N4O5S
Mol. Mass.432.493
SMILESNS(=O)(=O)c1ccc(NC(=O)CN2CCN(Cc3ccc4OCOc4c3)CC2)cc1