Reaction Details
TargetCarbonic anhydrase 7
LigandBDBM50237180
Substrate/Competitorn/a
Meas. Tech.ChEBML_1660631
Ki 21±n/a nM
Citation Mishra, CBKumari, SAngeli, AMonti, SMBuonanno, MTiwari, MSupuran, CT Discovery of Benzenesulfonamides with Potent Human Carbonic Anhydrase Inhibitory and Effective Anticonvulsant Action: Design, Synthesis, and Pharmacological Assessment. J Med Chem60:2456-2469 (2017) 
 
Carbonic anhydrase 7
Name:Carbonic anhydrase 7
Type:Enzyme
Mol. Mass.:29664.11
Organism:Homo sapiens (Human)
Description:Human cloned isozyme.
Residue:264
BDBM50237180
NameBDBM50237180
Synonyms:CHEMBL1363627
TypeSmall organic molecule
Emp. Form.C18H21FN4O3S
Mol. Mass.392.448
SMILESNS(=O)(=O)c1ccc(NC(=O)CN2CCN(CC2)c2ccc(F)cc2)cc1