Reaction Details
TargetCarbonic anhydrase 7
LigandBDBM50237184
Substrate/Competitorn/a
Meas. Tech.ChEBML_1660631
Ki 2.6±n/a nM
Citation Mishra, CBKumari, SAngeli, AMonti, SMBuonanno, MTiwari, MSupuran, CT Discovery of Benzenesulfonamides with Potent Human Carbonic Anhydrase Inhibitory and Effective Anticonvulsant Action: Design, Synthesis, and Pharmacological Assessment. J Med Chem60:2456-2469 (2017) 
 
Carbonic anhydrase 7
Name:Carbonic anhydrase 7
Type:Enzyme
Mol. Mass.:29664.11
Organism:Homo sapiens (Human)
Description:Human cloned isozyme.
Residue:264
BDBM50237184
NameBDBM50237184
Synonyms:CHEMBL4070147
TypeSmall organic molecule
Emp. Form.C19H22N4O4S
Mol. Mass.402.467
SMILESNS(=O)(=O)c1ccc(NC(=O)CN2CCN(CC2)C(=O)c2ccccc2)cc1