Reaction Details
TargetCarbonic anhydrase 12
LigandBDBM50237178
Substrate/Competitorn/a
Meas. Tech.ChEMBL_1660632 (CHEMBL4010244)
Ki>50000±n/a nM
Citation Mishra, CBKumari, SAngeli, AMonti, SMBuonanno, MTiwari, MSupuran, CT Discovery of Benzenesulfonamides with Potent Human Carbonic Anhydrase Inhibitory and Effective Anticonvulsant Action: Design, Synthesis, and Pharmacological Assessment. J Med Chem60:2456-2469 (2017) 
 
Carbonic anhydrase 12
Name:Carbonic anhydrase 12
Type:Enzyme
Mol. Mass.:39456.00
Organism:Homo sapiens (Human)
Description:Catalytic domain of human cloned isozyme was used in the assay
Residue:354
BDBM50237178
NameBDBM50237178
Synonyms:CHEMBL4068266
TypeSmall organic molecule
Emp. Form.C21H27N5O4S
Mol. Mass.445.535
SMILESCC(=O)c1ccc(cc1)N1CCN(CCNC(=O)Nc2ccc(cc2)S(N)(=O)=O)CC1