Reaction Details
TargetCarbonic anhydrase 2
LigandBDBM50237172
Substrate/Competitorn/a
Meas. Tech.ChEMBL_1660630 (CHEMBL4010242)
Ki 4.4±n/a nM
Citation Mishra, CBKumari, SAngeli, AMonti, SMBuonanno, MTiwari, MSupuran, CT Discovery of Benzenesulfonamides with Potent Human Carbonic Anhydrase Inhibitory and Effective Anticonvulsant Action: Design, Synthesis, and Pharmacological Assessment. J Med Chem60:2456-2469 (2017) 
 
Carbonic anhydrase 2
Name:Carbonic anhydrase 2
Type:Enzyme
Mol. Mass.:29250.71
Organism:Homo sapiens (Human)
Description:P00918
Residue:260
BDBM50237172
NameBDBM50237172
Synonyms:CHEMBL4080804
TypeSmall organic molecule
Emp. Form.C17H21N5O3S
Mol. Mass.375.445
SMILESNS(=O)(=O)c1ccc(NC(=O)CN2CCN(CC2)c2ccccn2)cc1