Reaction Details
TargetCarbonic anhydrase 2
LigandBDBM50237197
Substrate/Competitorn/a
Meas. Tech.ChEMBL_1660630 (CHEMBL4010242)
Ki 5.2±n/a nM
Citation Mishra, CBKumari, SAngeli, AMonti, SMBuonanno, MTiwari, MSupuran, CT Discovery of Benzenesulfonamides with Potent Human Carbonic Anhydrase Inhibitory and Effective Anticonvulsant Action: Design, Synthesis, and Pharmacological Assessment. J Med Chem60:2456-2469 (2017) 
 
Carbonic anhydrase 2
Name:Carbonic anhydrase 2
Type:Enzyme
Mol. Mass.:29250.71
Organism:Homo sapiens (Human)
Description:P00918
Residue:260
BDBM50237197
NameBDBM50237197
Synonyms:CHEMBL4080884
TypeSmall organic molecule
Emp. Form.C20H27N5O3S
Mol. Mass.417.525
SMILESNS(=O)(=O)c1ccc(NC(=O)NCCN2CCN(Cc3ccccc3)CC2)cc1