Reaction Details
TargetCarbonic anhydrase 12
LigandBDBM50237175
Substrate/Competitorn/a
Meas. Tech.ChEMBL_1660632 (CHEMBL4010244)
Ki>50000±n/a nM
Citation Mishra, CBKumari, SAngeli, AMonti, SMBuonanno, MTiwari, MSupuran, CT Discovery of Benzenesulfonamides with Potent Human Carbonic Anhydrase Inhibitory and Effective Anticonvulsant Action: Design, Synthesis, and Pharmacological Assessment. J Med Chem60:2456-2469 (2017) 
 
Carbonic anhydrase 12
Name:Carbonic anhydrase 12
Type:Enzyme
Mol. Mass.:39456.00
Organism:Homo sapiens (Human)
Description:Catalytic domain of human cloned isozyme was used in the assay
Residue:354
BDBM50237175
NameBDBM50237175
Synonyms:CHEMBL4098919
TypeSmall organic molecule
Emp. Form.C21H27N5O5S
Mol. Mass.461.535
SMILESNS(=O)(=O)c1ccc(NC(=O)NCCN2CCN(Cc3ccc4OCOc4c3)CC2)cc1