Reaction Details
TargetCarbonic anhydrase 2
LigandBDBM50237195
Substrate/Competitorn/a
Meas. Tech.ChEMBL_1660630 (CHEMBL4010242)
Ki 27±n/a nM
Citation Mishra, CBKumari, SAngeli, AMonti, SMBuonanno, MTiwari, MSupuran, CT Discovery of Benzenesulfonamides with Potent Human Carbonic Anhydrase Inhibitory and Effective Anticonvulsant Action: Design, Synthesis, and Pharmacological Assessment. J Med Chem60:2456-2469 (2017) 
 
Carbonic anhydrase 2
Name:Carbonic anhydrase 2
Type:Enzyme
Mol. Mass.:29250.71
Organism:Homo sapiens (Human)
Description:P00918
Residue:260
BDBM50237195
NameBDBM50237195
Synonyms:CHEMBL4094688
TypeSmall organic molecule
Emp. Form.C19H24N4O3S
Mol. Mass.388.484
SMILESCc1ccc(cc1)N1CCN(CC(=O)Nc2ccc(cc2)S(N)(=O)=O)CC1