Reaction Details
TargetCarbonic anhydrase 1
LigandBDBM50237170
Substrate/Competitorn/a
Meas. Tech.ChEMBL_1660629 (CHEMBL4010241)
Ki 3300±n/a nM
Citation Mishra, CBKumari, SAngeli, AMonti, SMBuonanno, MTiwari, MSupuran, CT Discovery of Benzenesulfonamides with Potent Human Carbonic Anhydrase Inhibitory and Effective Anticonvulsant Action: Design, Synthesis, and Pharmacological Assessment. J Med Chem60:2456-2469 (2017) 
 
Carbonic anhydrase 1
Name:Carbonic anhydrase 1
Type:Enzyme
Mol. Mass.:28873.37
Organism:Homo sapiens (Human)
Description:P00915
Residue:261
BDBM50237170
NameBDBM50237170
Synonyms:CHEMBL4059623
TypeSmall organic molecule
Emp. Form.C26H31N5O3S
Mol. Mass.493.621
SMILESNS(=O)(=O)c1ccc(NC(=O)NCCN2CCN(CC2)C(c2ccccc2)c2ccccc2)cc1