Reaction Details
TargetCarbonic anhydrase 1
LigandBDBM50237184
Substrate/Competitorn/a
Meas. Tech.ChEMBL_1660629 (CHEMBL4010241)
Ki 96±n/a nM
Citation Mishra, CBKumari, SAngeli, AMonti, SMBuonanno, MTiwari, MSupuran, CT Discovery of Benzenesulfonamides with Potent Human Carbonic Anhydrase Inhibitory and Effective Anticonvulsant Action: Design, Synthesis, and Pharmacological Assessment. J Med Chem60:2456-2469 (2017) 
 
Carbonic anhydrase 1
Name:Carbonic anhydrase 1
Type:Enzyme
Mol. Mass.:28873.37
Organism:Homo sapiens (Human)
Description:P00915
Residue:261
BDBM50237184
NameBDBM50237184
Synonyms:CHEMBL4070147
TypeSmall organic molecule
Emp. Form.C19H22N4O4S
Mol. Mass.402.467
SMILESNS(=O)(=O)c1ccc(NC(=O)CN2CCN(CC2)C(=O)c2ccccc2)cc1