Reaction Details
TargetCarbonic anhydrase 2
LigandBDBM50237193
Substrate/Competitorn/a
Meas. Tech.ChEMBL_1660630 (CHEMBL4010242)
Ki 9.1±n/a nM
Citation Mishra, CBKumari, SAngeli, AMonti, SMBuonanno, MTiwari, MSupuran, CT Discovery of Benzenesulfonamides with Potent Human Carbonic Anhydrase Inhibitory and Effective Anticonvulsant Action: Design, Synthesis, and Pharmacological Assessment. J Med Chem60:2456-2469 (2017) 
 
Carbonic anhydrase 2
Name:Carbonic anhydrase 2
Type:Enzyme
Mol. Mass.:29250.71
Organism:Homo sapiens (Human)
Description:P00918
Residue:260
BDBM50237193
NameBDBM50237193
Synonyms:CHEMBL4089446
TypeSmall organic molecule
Emp. Form.C26H29F2N5O3S
Mol. Mass.529.602
SMILESNS(=O)(=O)c1ccc(NC(=O)NCCN2CCN(CC2)C(c2ccc(F)cc2)c2ccc(F)cc2)cc1