Reaction Details
TargetCarbonic anhydrase 7
LigandBDBM50237197
Substrate/Competitorn/a
Meas. Tech.ChEMBL_1660631 (CHEMBL4010243)
Ki>50000±n/a nM
Citation Mishra, CBKumari, SAngeli, AMonti, SMBuonanno, MTiwari, MSupuran, CT Discovery of Benzenesulfonamides with Potent Human Carbonic Anhydrase Inhibitory and Effective Anticonvulsant Action: Design, Synthesis, and Pharmacological Assessment. J Med Chem60:2456-2469 (2017) 
 
Carbonic anhydrase 7
Name:Carbonic anhydrase 7
Type:Enzyme
Mol. Mass.:29664.11
Organism:Homo sapiens (Human)
Description:Human cloned isozyme.
Residue:264
BDBM50237197
NameBDBM50237197
Synonyms:CHEMBL4080884
TypeSmall organic molecule
Emp. Form.C20H27N5O3S
Mol. Mass.417.525
SMILESNS(=O)(=O)c1ccc(NC(=O)NCCN2CCN(Cc3ccccc3)CC2)cc1